{"text_format":"1","workbook":"xlsx","n_sheets":15,"sheets":["Summary","Matrix_Search","Matrix","Factor  - P","Factor  - Ec","Factor  - S","Factor  - T","Factor  - En","Factor  - L","References","Regulations","TO ADD","Source","Overall explanation","Pivot Table"],"not_rendered":{"charts":25,"images":2,"macros":1,"external_links":1,"defined_names":56,"comments":4,"pivot_tables":1},"unopened":[],"bounds":{"document_bytes":16777216,"sheet_cells":100000,"rows_first":2000,"rows_last":500,"rows_between":2000,"halvings":0,"cell_chars":16384,"cell_head_chars":4096},"cells_cut":0,"cells_raw":0,"read":"whole","date_system":"1900"}

{"sheet":"Summary","index":0,"n_rows":70,"n_cols":6,"rows_kept":70,"cut":false,"hidden":false,"merged":[]}
["P","Ec","S","T","En","L"]
["POLITICAL","ECONOMIC","SOCIAL ","TECHNOLOGICAL","ENVIRONMENTAL","LEGAL"]
[{"$f":"_xlfn._xlws.FILTER(Matrix!$C$2:$C213,Matrix!$E$2:$E213=A$1)","v":"Collaboration with Stakeholders"},{"$f":"_xlfn._xlws.FILTER(Matrix!$C$2:$C213,Matrix!$E$2:$E213=B$1)","v":"Algae Cultivation"},{"$f":"_xlfn._xlws.FILTER(Matrix!$C$2:$C213,Matrix!$E$2:$E213=C$1)","v":"Authority Process "},{"$f":"_xlfn._xlws.FILTER(Matrix!$C$2:$C213,Matrix!$E$2:$E213=D$1)","v":"Cost opttimization"},{"$f":"_xlfn._xlws.FILTER(Matrix!$C$2:$C213,Matrix!$E$2:$E213=E$1)","v":"Air Pollution"},{"$f":"_xlfn._xlws.FILTER(Matrix!$C$2:$C213,Matrix!$E$2:$E213=F$1)","v":"Local community engagement"}]
["International Cooperation","Co-Products Revenue Generation","Call for Clarity on PTX Plans","System and fuel production costs - deterministic","Greenhouse Gas Emissions","CO2 Tax"]
["Energy Independece ","District Heating System","Communication Lines","Biogenic Carbon (CO2)","Local Heavy Transportation","Regulation - effect on Investors"]
["Energy Security","Electricity Costs vs. Oxygen Savings","Ownership models for project acceptance improvement","Biogenic Carbon (CO2) - External source","Local industry Energy usage","Regulation - effect on Off-takers"]
{"$rows_left_out":65}
{"sheet":"Matrix_Search","index":1,"n_rows":2051,"n_cols":16,"rows_kept":2051,"cut":false,"hidden":true,"merged":[]}
[]
[null,"cost"]
[]
[null,{"$f":"Matrix!$C$1:$Q$1","v":"Factor"},"Detail","Domain","WP","Impact","Relevance","S/W","O/T","Value","Other_References","Main_Reference","Citation","Entry by","Validated","Notes & Feedback"]
[{"$f":"_xlfn.XLOOKUP(C5,Matrix!D2:D72,Matrix!A2:A72,\"nf\",0)","v":"F.004"},{"$f":"_xlfn._xlws.FILTER(Matrix!$C$2:$Q$213,(ISNUMBER(SEARCH(B2,Matrix!$C$2:$C$213))))","v":"Electricity Costs vs. Oxygen Savings"},"The cost of electricity for operating compressors in waste water treatment and other industries significantly impacts operational expenses. Exploring potential savings by using oxygen instead of air can provide a strong financial incentive for transitioning.","Ec","WP3","Positive (+)",4,"S","O",8,"_REACTRF-22-0054_WP3 - Market for Oxygen","_REACTRF-22-0054_WP3 - Report","Bendtsen, M.F. REACTRF-22-0054 - Work Package 3: Market for products (2023). Rønne Havn A/S. ","O. Uribe",0,0]
[{"$f":"_xlfn.XLOOKUP(C6,Matrix!D5:D72,Matrix!A5:A72,\"nf\",0)","v":"F.017"},"Benchmarking of Biofuels production cost","Move to extension","Ec","Ext.","Neutral (+/-)",0,0,0,0,0,0,{"$error":"#N/A"},"O. Uribe",0,0]
{"$rows_left_out":2046}
{"sheet":"Matrix","index":2,"n_rows":213,"n_cols":17,"rows_kept":213,"cut":false,"hidden":false,"merged":[]}
["F.ID","Category","Factor","Detail","Domain","WP","Impact","Relevance","S/W","O/T","Value","Other_References","Main_Reference","Citation","Entry by","Validated","Notes & Feedback"]
[{"$f":"\"F.\" & TEXT(_xlfn.SEQUENCE(COUNTA(C$1:C$870)),\"00#\")","v":"F.001"},"Alternative markets","Algae Cultivation","Algae production using waste heat for drying; potential for protein or raw material production.","Ec","WP3","Positive (+)",3,"S","O",{"$f":"_xlfn.XLOOKUP(G2,Source!$E$3:$E$6,Source!$G$3:$G$6)*_xlfn.XLOOKUP(H2,Source!$I$3:$I$9,Source!$J$3:$J$9)","v":6},"T3.5 Market for waste heat  - 2022.11.17 Power-to-X Feasibility Study Bornholm WP3.5 ver2","_REACTRF-22-0054_WP3 - Report",{"$f":"_xlfn.XLOOKUP(M2,References[Reference],References[Citation])","v":"Bendtsen, M.F. REACTRF-22-0054 - Work Package 3: Market for products (2023). Rønne Havn A/S. "},"O. Uribe"]
["F.002","Alternative markets","Co-Products Revenue Generation","Potential revenue from co-products considered but not included in cost analysis","Ec","WP2","Neutral (+/-)",1,null,null,{"$f":"_xlfn.XLOOKUP(G3,Source!$E$3:$E$6,Source!$G$3:$G$6)*_xlfn.XLOOKUP(H3,Source!$I$3:$I$9,Source!$J$3:$J$9)","v":1},null,"_REACTRF-22-0054_WP2 - Report",{"$f":"_xlfn.XLOOKUP(M3,References[Reference],References[Citation])","v":"Garcia Marín, D., Busch-Knudsen, J.F., Letoffet, A., Campion, N. & Münster, M.  REACTRF-22-0054 - Work Package 2: Modelling of scenarios for Power-to-X production in Bornholm (2023). Technical University of Denmark, Department oof Technology, Management and Economics. "},"O. Uribe"]
["F.003","Alternative markets","District Heating System","Bornholm's DH system is divided into 5 systems; total production is about 335 GWh/year.","Ec","WP3","Neutral (+/-)",3,"W","T",{"$f":"_xlfn.XLOOKUP(G4,Source!$E$3:$E$6,Source!$G$3:$G$6)*_xlfn.XLOOKUP(H4,Source!$I$3:$I$9,Source!$J$3:$J$9)","v":3},"T3.5 Market for waste heat  - 2022.11.17 Power-to-X Feasibility Study Bornholm WP3.5 ver2","_REACTRF-22-0054_WP3 - Report",{"$f":"_xlfn.XLOOKUP(M4,References[Reference],References[Citation])","v":"Bendtsen, M.F. REACTRF-22-0054 - Work Package 3: Market for products (2023). Rønne Havn A/S. "},"O. Uribe"]
["F.004","Alternative markets","Electricity Costs vs. Oxygen Savings","The cost of electricity for operating compressors in waste water treatment and other industries significantly impacts operational expenses. Exploring potential savings by using oxygen instead of air can provide a strong financial incentive for transitioning.","Ec","WP3","Positive (+)",4,"S","O",{"$f":"_xlfn.XLOOKUP(G5,Source!$E$3:$E$6,Source!$G$3:$G$6)*_xlfn.XLOOKUP(H5,Source!$I$3:$I$9,Source!$J$3:$J$9)","v":8},"_REACTRF-22-0054_WP3 - Market for Oxygen","_REACTRF-22-0054_WP3 - Report",{"$f":"_xlfn.XLOOKUP(M5,References[Reference],References[Citation])","v":"Bendtsen, M.F. REACTRF-22-0054 - Work Package 3: Market for products (2023). Rønne Havn A/S. "},"O. Uribe"]
["F.005","Alternative markets","Greenhouse","Niche greenhouse farming possibility using excess heat; competitive advantage.","Ec","WP3","Positive (+)",3,"S","O",{"$f":"_xlfn.XLOOKUP(G6,Source!$E$3:$E$6,Source!$G$3:$G$6)*_xlfn.XLOOKUP(H6,Source!$I$3:$I$9,Source!$J$3:$J$9)","v":6},"T3.5 Market for waste heat  - 2022.11.17 Power-to-X Feasibility Study Bornholm WP3.5 ver2","_REACTRF-22-0054_WP3 - Report",{"$f":"_xlfn.XLOOKUP(M6,References[Reference],References[Citation])","v":"Bendtsen, M.F. REACTRF-22-0054 - Work Package 3: Market for products (2023). Rønne Havn A/S. "},"O. Uribe"]
{"$rows_left_out":208}
{"sheet":"Factor  - P","index":3,"n_rows":27,"n_cols":26,"rows_kept":27,"cut":false,"hidden":false,"merged":[]}
[null,"Factor Domain","POLITICAL",null,null,null,null,null,null,null,null,null,null,null,null,"All inner equal"]
[null,null,null,null,null,null,null,"Data  for Radar",null,null,null,null,null,null,null,"Data  for Sunburst  -  Scatter",null,null,null,null,null,null,null,null,"Data for border doughnut & background pie"]
[]
["Category","Factor","Domain","WP","Impact","Relevance","Value","ID",null,"Category","Factor","Impact","Impact","Relevance","Value","top","Category","Factor","Impact","Value","Value",null,10,null,{"$f":"_xlfn.UNIQUE(A5:A27)","v":"Collaboration and International Cooperation"},{"$f":"COUNTIF($Q$5:$Q$27,$Y4)","v":2}]
[{"$f":"_xlfn._xlws.SORT(_xlfn.CHOOSECOLS(_xlfn._xlws.FILTER(MatrixTable[],MatrixTable[Domain]=_xlfn.XLOOKUP(C1,Source!B3:B8,Domain)),1,2,4,5,6,7,10),1,1)","v":"Collaboration and International Cooperation"},"Collaboration with Stakeholders","P","WP5","Positive (+)",4,8,1,null,{"$f":"+$A5","v":"Collaboration and International Cooperation"},{"$f":"+$B5","v":"Collaboration with Stakeholders"},null,{"$f":"IF($E5=\"Positive (+)\",2,IF($E5=\"Neutral (+/-)\",1,IF($E5=\"Negative (-)\",-1)))","v":2},{"$f":"+$F5","v":4},{"$f":"+$G5","v":8},12,{"$f":"+$A5","v":"Collaboration and International Cooperation"},{"$f":"_xlfn.CONCAT(H5,\". \",$B5)","v":"1. Collaboration with Stakeholders"},null,{"$f":"+$V$7/2+U5","v":3.00285},{"$f":"+U6+U6","v":2.0000000000000001E-4},{"$f":"SUM(T5:T6)","v":6.0056000000000003},{"$f":"SUM(T5:T6)","v":6.0056000000000003},null,"Energy Independence and Security",{"$f":"COUNTIF($Q$5:$Q$27,$Y5)","v":4}]
["Collaboration and International Cooperation","International Cooperation","P","WP6","Positive (+)",2,4,2,null,"Collaboration and International Cooperation","International Cooperation",null,2,{"$f":"+$F6","v":2},4,{"$f":"+$P$5","v":12},{"$f":"+$A6","v":"Collaboration and International Cooperation"},{"$f":"_xlfn.CONCAT(H6,\". \",$B6)","v":"2. International Cooperation"},null,{"$f":"+$V$7/2+U6","v":3.0027500000000003},1E-4,null,null,null,"Environmental Impact",3]
{"$rows_left_out":22}
{"sheet":"Factor  - Ec","index":4,"n_rows":72,"n_cols":26,"rows_kept":72,"cut":false,"hidden":false,"merged":[]}
[null,"Factor Domain","ECONOMIC",null,null,{"$f":"SUM(T43:U43)","v":1.1164555555555555},null,null,null,null,null,null,null,null,null,"All inner equal"]
[null,null,null,null,null,null,null,"Data  for Radar",null,null,null,null,null,null,null,"Data  for Sunburst  -  Scatter",null,null,null,null,null,null,null,null,"Data for border doughnut & background pie"]
[]
["Category","Factor","Domain","WP","Impact","Relevance","Value","ID",null,"Category","Factor","Impact","Impact","Relevance","Value","top","Category","Factor","Impact","Value","Value",null,null,null,{"$f":"_xlfn.UNIQUE(A5:A72)","v":"Alternative markets"},{"$f":"COUNTIF($Q$5:$Q$72,$Y4)","v":16}]
[{"$f":"_xlfn._xlws.SORT(_xlfn.CHOOSECOLS(_xlfn._xlws.FILTER(MatrixTable[],MatrixTable[Domain]=_xlfn.XLOOKUP(C1,Source!B3:B8,Domain)),1,2,4,5,6,7,10),1,1)","v":"Alternative markets"},"Algae Cultivation","Ec","WP3","Positive (+)",3,6,1,null,{"$f":"+$A5","v":"Alternative markets"},{"$f":"+$B5","v":"Algae Cultivation"},null,{"$f":"IF($E5=\"Positive (+)\",2,IF($E5=\"Neutral (+/-)\",1,IF($E5=\"Negative (-)\",-1)))","v":2},{"$f":"+$F5","v":3},{"$f":"+$G5","v":6},12,{"$f":"+$A5","v":"Alternative markets"},{"$f":"_xlfn.CONCAT(H5,\". \",$B5)","v":"1. Algae Cultivation"},null,{"$f":"$V$21/6+U5","v":1.6928500000000002},{"$f":"+U6+$U$20","v":1.6000000000000007E-2},{"$f":"SUM(T21:T24)","v":10.068100000000001},null,null,"Benchmarking",{"$f":"COUNTIF($Q$5:$Q$72,$Y5)","v":4}]
["Alternative markets","Co-Products Revenue Generation","Ec","WP2","Neutral (+/-)",1,1,2,null,"Alternative markets","Co-Products Revenue Generation",null,1,{"$f":"+$F6","v":1},1,{"$f":"+$P$5","v":12},{"$f":"+$A6","v":"Alternative markets"},{"$f":"_xlfn.CONCAT(H6,\". \",$B6)","v":"2. Co-Products Revenue Generation"},null,1.6918500000000001,1.5000000000000008E-2,null,null,null,"Incentives",4]
{"$rows_left_out":67}
{"sheet":"Factor  - S","index":5,"n_rows":29,"n_cols":26,"rows_kept":29,"cut":false,"hidden":false,"merged":[]}
[null,"Factor Domain","SOCIAL ",null,null,null,null,null,null,null,null,null,null,null,null,"All inner equal"]
[null,null,null,null,null,null,null,"Data  for Radar",null,null,null,null,null,null,null,"Data  for Sunburst  -  Scatter",null,null,null,null,null,null,null,null,"Data for border doughnut & background pie"]
[]
["Category","Factor","Domain","WP","Impact","Relevance","Value","ID",null,"Category","Factor","Impact","Impact","Relevance","Value","top","Category","Factor","Impact","Value","Value",null,null,null,{"$f":"_xlfn.UNIQUE(A5:A29)","v":"Community Involvement & Acceptance"},{"$f":"COUNTIF($Q$5:$Q$29,$Y4)","v":5}]
[{"$f":"_xlfn._xlws.SORT(_xlfn.CHOOSECOLS(_xlfn._xlws.FILTER(MatrixTable[],MatrixTable[Domain]=_xlfn.XLOOKUP(C1,Source!B3:B8,Domain)),1,2,4,5,6,7,10),1,1)","v":"Community Involvement & Acceptance"},"Authority Process ","S","WP5","Positive (+)",5,10,1,null,{"$f":"+$A5","v":"Community Involvement & Acceptance"},{"$f":"+$B5","v":"Authority Process "},null,{"$f":"IF($E5=\"Positive (+)\",2,IF($E5=\"Neutral (+/-)\",1,IF($E5=\"Negative (-)\",-1)))","v":2},{"$f":"+$F5","v":5},{"$f":"+$G5","v":10},12,{"$f":"+$A5","v":"Community Involvement & Acceptance"},{"$f":"_xlfn.CONCAT(H5,\". \",$B5)","v":"1. Authority Process "},null,{"$f":"$V$10/5+U5","v":2.0057799999999997},{"$f":"+U6+$U$9","v":5.0000000000000001E-3},{"$f":"SUM(T10:T13)","v":10.003200000000003},null,null,"Cultural and Heritage",{"$f":"COUNTIF($Q$5:$Q$29,$Y5)","v":4}]
["Community Involvement & Acceptance","Call for Clarity on PTX Plans","S","WP6","Negative (-)",4,-4,2,null,"Community Involvement & Acceptance","Call for Clarity on PTX Plans",null,-1,{"$f":"+$F6","v":4},-4,{"$f":"+$P$5","v":12},{"$f":"+$A6","v":"Community Involvement & Acceptance"},{"$f":"_xlfn.CONCAT(H6,\". \",$B6)","v":"2. Call for Clarity on PTX Plans"},null,{"$f":"$V$10/5+U6","v":2.0047799999999998},{"$f":"+U7+$U$9","v":4.0000000000000001E-3},null,null,null,"Effect on local communities",{"$f":"COUNTIF($Q$5:$Q$29,$Y6)","v":8}]
{"$rows_left_out":24}
{"sheet":"Factor  - T","index":6,"n_rows":55,"n_cols":26,"rows_kept":55,"cut":false,"hidden":false,"merged":[]}
[null,"Factor Domain","TECHNOLOGICAL",null,null,{"$f":"SUM(T43:U43)","v":1.112511111111111},null,null,null,null,null,null,null,null,null,"All inner equal"]
[null,null,null,null,null,null,null,"Data  for Radar",null,null,null,null,null,null,null,"Data  for Sunburst  -  Scatter",null,null,null,null,null,null,null,null,"Data for border doughnut & background pie"]
[]
["Category","Factor","Domain","WP","Impact","Relevance","Value","ID",null,"Category","Factor","Impact","Impact","Relevance","Value","top","Category","Factor","Impact","Value","Value",null,10,null,{"$f":"_xlfn.UNIQUE(A5:A54)","v":"Costs"},{"$f":"COUNTIF($Q$5:$Q$55,$Y4)","v":2}]
[{"$f":"_xlfn._xlws.SORT(_xlfn.CHOOSECOLS(_xlfn._xlws.FILTER(MatrixTable[],MatrixTable[Domain]=_xlfn.XLOOKUP(C1,Source!B3:B8,Domain)),1,2,4,5,6,7,10),1,1)","v":"Costs"},"Cost opttimization","T","WP2","Negative (-)",5,-5,1,null,{"$f":"+$A5","v":"Costs"},{"$f":"+$B5","v":"Cost opttimization"},null,{"$f":"IF($E5=\"Positive (+)\",2,IF($E5=\"Neutral (+/-)\",1,IF($E5=\"Negative (-)\",-1)))","v":-1},{"$f":"+$F5","v":5},{"$f":"+$G5","v":-5},12,{"$f":"+$A5","v":"Costs"},{"$f":"_xlfn.CONCAT(H5,\". \",$B5)","v":"1. Cost opttimization"},null,{"$f":"+$V$5/2+U5","v":5.0131500000000004},{"$f":"+U6+U6","v":2.0000000000000001E-4},{"$f":"SUM(T7:T22)","v":10.0259},{"$f":"SUM(T5:T6)","v":10.026199999999999},null,"Energy and Input",16]
["Costs","System and fuel production costs - deterministic","T","WP2","Positive (+)",4,8,2,null,"Costs","System and fuel production costs - deterministic",null,2,{"$f":"+$F6","v":4},8,{"$f":"+$P$5","v":12},{"$f":"+$A6","v":"Costs"},{"$f":"_xlfn.CONCAT(H6,\". \",$B6)","v":"2. System and fuel production costs - deterministic"},null,{"$f":"+$V$5/2+U6","v":5.0130499999999998},1E-4,null,null,null,"Environmental Considerations",2]
{"$rows_left_out":50}
{"sheet":"Factor  - En","index":7,"n_rows":20,"n_cols":26,"rows_kept":20,"cut":false,"hidden":false,"merged":[]}
[null,"Factor Domain","ENVIRONMENTAL",null,null,null,null,null,null,null,null,null,null,null,null,"All inner equal"]
[null,null,null,null,null,null,null,"Data  for Radar",null,null,null,null,null,null,null,"Data  for Sunburst  -  Scatter",null,null,null,null,null,null,null,null,"Data for border doughnut & background pie"]
[]
["Category","Factor","Domain","WP","Impact","Relevance","Value","ID",null,"Category","Factor","Impact","Impact","Relevance","Value","top","Category","Factor","Impact","Value","Value",null,null,null,{"$f":"_xlfn.UNIQUE(A5:A29)","v":"Emission and Pollution"},{"$f":"COUNTIF($Q$5:$Q$29,$Y4)","v":2}]
[{"$f":"_xlfn._xlws.SORT(_xlfn.CHOOSECOLS(_xlfn._xlws.FILTER(MatrixTable[],MatrixTable[Domain]=_xlfn.XLOOKUP(C1,Source!B3:B8,Domain)),1,2,4,5,6,7,10),1,1)","v":"Emission and Pollution"},"Air Pollution","En","WP6","Negative (-)",4,-4,1,null,{"$f":"+$A5","v":"Emission and Pollution"},{"$f":"+$B5","v":"Air Pollution"},null,{"$f":"IF($E5=\"Positive (+)\",2,IF($E5=\"Neutral (+/-)\",1,IF($E5=\"Negative (-)\",-1)))","v":-1},{"$f":"+$F5","v":4},{"$f":"+$G5","v":-4},12,{"$f":"+$A5","v":"Emission and Pollution"},{"$f":"_xlfn.CONCAT(H5,\". \",$B5)","v":"1. Air Pollution"},null,{"$f":"+$V$7/2+U5","v":5.0019500000000097},{"$f":"+U6+$U$20","v":2.0000000000000001E-4},{"$f":"SUM(T7:T8)","v":10.002400000000016},null,null,"Energy Sources and Consumption",{"$f":"COUNTIF($Q$5:$Q$29,$Y5)","v":2}]
["Emission and Pollution","Greenhouse Gas Emissions","En","WP6","Positive (+)",4,8,2,null,"Emission and Pollution","Greenhouse Gas Emissions",null,2,{"$f":"+$F6","v":4},8,{"$f":"+$P$5","v":12},{"$f":"+$A6","v":"Emission and Pollution"},{"$f":"_xlfn.CONCAT(H6,\". \",$B6)","v":"2. Greenhouse Gas Emissions"},null,{"$f":"+$V$7/2+U6","v":5.001850000000009},1E-4,null,null,null,"Environmental Impact and Conservation",{"$f":"COUNTIF($Q$5:$Q$29,$Y6)","v":5}]
{"$rows_left_out":15}
{"sheet":"Factor  - L","index":8,"n_rows":28,"n_cols":26,"rows_kept":28,"cut":false,"hidden":false,"merged":[]}
[null,"Factor Domain","LEGAL",null,null,null,null,null,null,null,null,null,null,null,null,"All inner equal"]
[null,null,null,null,null,null,null,"Data  for Radar",null,null,null,null,null,null,null,"Data  for Sunburst  -  Scatter",null,null,null,null,null,null,null,null,"Data for border doughnut & background pie"]
[]
["Category","Factor","Domain","WP","Impact","Relevance","Value","ID",null,"Category","Factor","Impact","Impact","Relevance","Value","top","Category","Factor","Impact","Value","Value",null,null,null,{"$f":"_xlfn.UNIQUE(A5:A28)","v":"Community Engagement and Local Impact:"},{"$f":"COUNTIF($Q$5:$Q$27,$Y4)","v":1}]
[{"$f":"_xlfn._xlws.SORT(_xlfn.CHOOSECOLS(_xlfn._xlws.FILTER(MatrixTable[],MatrixTable[Domain]=_xlfn.XLOOKUP(C1,Source!B3:B8,Domain)),1,2,4,5,6,7,10),1,1)","v":"Community Engagement and Local Impact:"},"Local community engagement","L","WP6","Positive (+)",5,10,1,null,{"$f":"+$A5","v":"Community Engagement and Local Impact:"},{"$f":"+$B5","v":"Local community engagement"},null,{"$f":"IF($E5=\"Positive (+)\",2,IF($E5=\"Neutral (+/-)\",1,IF($E5=\"Negative (-)\",-1)))","v":2},{"$f":"+$F5","v":5},{"$f":"+$G5","v":10},12,{"$f":"+$A5","v":"Community Engagement and Local Impact:"},{"$f":"_xlfn.CONCAT(H5,\". \",$B5)","v":"1. Local community engagement"},null,{"$f":"+V6+U28","v":10.006300000000001},1E-4,null,null,null,"Economic and Financial Factors",4]
["Economic and Financial Factors","CO2 Tax","L","WP6","Positive (+)",4,8,2,null,"Economic and Financial Factors","CO2 Tax",null,2,{"$f":"+$F6","v":4},8,{"$f":"+$P$5","v":12},{"$f":"+$A6","v":"Economic and Financial Factors"},{"$f":"_xlfn.CONCAT(H6,\". \",$B6)","v":"2. CO2 Tax"},null,{"$f":"+$V$10/4+U6","v":2.5017000000000005},{"$f":"+U7+$U$9","v":4.0000000000000002E-4},{"$f":"SUM(T6:T9)","v":10.006200000000002},null,null,"Environmental and Sustainability Regulations",7]
{"$rows_left_out":23}
{"sheet":"References","index":9,"n_rows":226,"n_cols":5,"rows_kept":226,"cut":false,"hidden":false,"merged":[]}
["Ref_ID","Reference","Link","Citation","Column1"]
[{"$f":"\"R.\" & TEXT(_xlfn.SEQUENCE(COUNTA(B:B)),\"00#\")","v":"R.001"},"_REACTRF-22-0054_WP1 - Report","https://roennehavn.sharepoint.com/:b:/s/PtXFeasibility/ERBr1kNbPYhOg2dy6WsSZK8B2twK8wRIt9qzf3dwNC5Myw?e=zonEc9","Jacobsen, C. et al.  Work Package 1-Feasibility Study for Power-to-X Production on Bornholm (2022). Bornholms Energi & Forsyning A/S (BEOF) ."]
["R.002","_REACTRF-22-0054_WP2 - Report","https://roennehavn.sharepoint.com/:b:/s/PtXFeasibility/Ec0ln6IuqltCiD0498pyqCMBI6xU2zNfkPYfG-ArYzlmsw?e=t0ppaj","Garcia Marín, D., Busch-Knudsen, J.F., Letoffet, A., Campion, N. & Münster, M.  REACTRF-22-0054 - Work Package 2: Modelling of scenarios for Power-to-X production in Bornholm (2023). Technical University of Denmark, Department oof Technology, Management and Economics. "]
["R.003","_REACTRF-22-0054_WP3 - Market for Oxygen","https://roennehavn.sharepoint.com/:b:/s/PtXFeasibility/EUlISbg5h_FPjRn-tU2P_tQBb4f1yk9c62rGwkTuQrlANQ?e=Zhc0el","_REACTRF-22-0054_WP3 - Market for Oxygen (2023)"]
["R.004","_REACTRF-22-0054_WP3 - Report",null,"Bendtsen, M.F. REACTRF-22-0054 - Work Package 3: Market for products (2023). Rønne Havn A/S. "]
["R.005","_REACTRF-22-0054_WP4 - Report",null,"You, S. REACTRF-22-0054 - Work Package 4: Integration into energy systems (2023). DTU Wind and Energy Systems."]
{"$rows_left_out":221}
{"sheet":"Regulations","index":10,"n_rows":317,"n_cols":2,"rows_kept":317,"cut":false,"hidden":true,"merged":[]}
["Regulations implementing EU directive 32018L2001","BEK no 946 of 26/06/2023"]
[null,"APPLICABLE"]
[null,"Order on grants for conversions to heat pumps in buildings for year-round occupancy (Heat pump pool)"]
[null,"2023-06-28"]
[null,"BEK no 913 of 22/06/2023"]
[null,"APPLICABLE"]
{"$rows_left_out":312}
{"sheet":"TO ADD","index":11,"n_rows":2,"n_cols":3,"rows_kept":2,"cut":false,"hidden":true,"merged":[]}
[null,"Review","https://dma.dk/Media/637847381174295461/ZESM%20Roadmap.pdf"]
[null,"Review","https://www.linkedin.com/pulse/electrolyser-efficiency-gareth-richardson%3FtrackingId=3z7zS2dy5uTk8rdYNiDUXg%253D%253D/?trackingId=3z7zS2dy5uTk8rdYNiDUXg%3D%3D"]

{"sheet":"Source","index":12,"n_rows":96,"n_cols":17,"rows_kept":96,"cut":false,"hidden":false,"merged":[[12,4,12,5],[29,2,29,4]]}
[]
[null,"Domain",null,null,"Impact",null,null,null,"Relevance",null,null,null,"Validation"]
[null,"POLITICAL","P","#D31774","Positive (+)","(+)",2,null,0,0,"Very Low - (0)",null,"Name ","Organization","Org ","Role","Code"]
[null,"ECONOMIC","Ec","#FF7A47","Neutral (+/-)","(+/-)",1,null,1,1,"Low  - (1)",null,"A. Damgaard","Technical University of Denmark (Wind and Energy Systems) ","DTU.WE","Steering Committee Member","SC"]
[null,"SOCIAL ","S","#FFD900","Negative (-)","(-)",-1,null,2,2,"Medium Low - (2)",null,"A. Letoffet","Technical University of Denmark (Management) ","DTU.Man","Team Member","TM"]
[null,"TECHNOLOGICAL","T","#8DC680","N/A - (0)","N/A",0,null,3,3,"Medium - (3)",null,"A. Thomas","CRT","CRT","Team Member","TM"]
{"$rows_left_out":91}
{"sheet":"Overall explanation","index":13,"n_rows":7,"n_cols":2,"rows_kept":7,"cut":false,"hidden":false,"merged":[]}
["PESTEL Factor","Explanation"]
["POLITICAL","The political factor assesses the influence of government policies, regulations, and stability on Power-to-X (PtX) technologies. This includes factors such as energy policies, subsidies, incentives, and political support for renewable energy and PtX development. Political stability and geopolitical factors that may affect the availability and affordability of energy resources are also considered."]
["ECONOMIC","The economic factor evaluates the financial aspects and market conditions related to PtX technologies. It includes factors such as the cost of production, market demand and price for PtX products, energy prices, government incentives and subsidies, as well as the availability and cost of infrastructure and raw materials required for PtX processes. Economic viability and competitiveness of PtX technologies are assessed under this factor."]
["SOCIAL ","The social (sociocultural) factor explores the social and cultural aspects that may impact the acceptance and adoption of PtX technologies. This includes public awareness and perception of renewable energy, attitudes towards PtX products, consumer preferences, and societal values related to sustainability and environmental concerns. Social acceptance and willingness to embrace PtX as a viable energy solution are considered."]
["TECHNOLOGICAL","The technological factor assesses the level of technological advancements and innovation in PtX processes. It includes factors such as research and development (R&D) activities, efficiency improvements, scalability, and the availability of supporting technologies. The rate of technological progress, including breakthroughs and cost reduction potential, can significantly impact the development and deployment of PtX technologies."]
["ENVIRONMENTAL","The environmental factor focuses on the ecological impact and sustainability of PtX technologies. It includes factors such as carbon emissions reduction potential, resource utilization efficiency, water and land use, as well as the overall environmental footprint of PtX processes. Environmental regulations and policies related to renewable energy and greenhouse gas emissions are also considered."]
{"$rows_left_out":2}
{"sheet":"Pivot Table","index":14,"n_rows":64,"n_cols":13,"rows_kept":64,"cut":false,"hidden":false,"merged":[]}
["Domain","Ec"]
["Impact","(All)"]
["Relevance","(All)"]
[]
["Average of Value","Column Labels"]
["Row Labels",-5,-4,-3,-2,-1,3,4,6,8,10,"#N/A","Grand Total"]
{"$rows_left_out":58}